Reaction Details
TargetP2Y purinoceptor 2
LigandBDBM50336769
Substrate/Competitorn/a
Meas. Tech.ChEMBL_463988 (CHEMBL929975)
IC50 17000±n/a nM
Citation Weyler, SBaqi, YHillmann, PKaulich, MHunder, AMMüller, IAMüller, CE Combinatorial synthesis of anilinoanthraquinone derivatives and evaluation as non-nucleotide-derived P2Y2 receptor antagonists. Bioorg Med Chem Lett18:223-7 (2008) 
 
P2Y purinoceptor 2
Name:P2Y purinoceptor 2
Type:PROTEIN
Mol. Mass.:42202.78
Organism:Mus musculus
Description:ChEMBL_587770
Residue:373
BDBM50336769
NameBDBM50336769
Synonyms:CHEMBL403051 | sodium 1-amino-4-(2-ethoxyphenylamino)-9,10-dioxo-9,10-dihydroanthracene-2-sulfonate
TypeSmall organic molecule
Emp. Form.C22H17N2O6S
Mol. Mass.437.446
SMILESCCOc1ccccc1Nc1cc(c(N)c2C(=O)c3ccccc3C(=O)c12)S([O-])(=O)=O