Reaction Details
TargetP2Y purinoceptor 2
LigandBDBM50336791
Substrate/Competitorn/a
Meas. Tech.ChEMBL_463988 (CHEMBL929975)
IC50 14000±n/a nM
Citation Weyler, SBaqi, YHillmann, PKaulich, MHunder, AMMüller, IAMüller, CE Combinatorial synthesis of anilinoanthraquinone derivatives and evaluation as non-nucleotide-derived P2Y2 receptor antagonists. Bioorg Med Chem Lett18:223-7 (2008) 
 
P2Y purinoceptor 2
Name:P2Y purinoceptor 2
Type:PROTEIN
Mol. Mass.:42202.78
Organism:Mus musculus
Description:ChEMBL_587770
Residue:373
BDBM50336791
NameBDBM50336791
Synonyms:CHEMBL402239 | sodium 1-amino-4-(2,3-dimethylphenylamino)-9,10-dioxo-9,10-dihydroanthracene-2-sulfonate
TypeSmall organic molecule
Emp. Form.C22H17N2O5S
Mol. Mass.421.446
SMILESCc1cccc(Nc2cc(c(N)c3C(=O)c4ccccc4C(=O)c23)S([O-])(=O)=O)c1C