Reaction Details
TargetP2Y purinoceptor 2
LigandBDBM50371701
Substrate/Competitorn/a
Meas. Tech.ChEMBL_463989 (CHEMBL929976)
IC50 11500±n/a nM
Citation Weyler, SBaqi, YHillmann, PKaulich, MHunder, AMMüller, IAMüller, CE Combinatorial synthesis of anilinoanthraquinone derivatives and evaluation as non-nucleotide-derived P2Y2 receptor antagonists. Bioorg Med Chem Lett18:223-7 (2008) 
 
P2Y purinoceptor 2
Name:P2Y purinoceptor 2
Type:PROTEIN
Mol. Mass.:42299.21
Organism:Homo sapiens (Human)
Description:ChEMBL_1455361
Residue:377
BDBM50371701
NameBDBM50371701
Synonyms:CHEMBL271881
TypeSmall organic molecule
Emp. Form.C22H17N2O6S
Mol. Mass.437.446
SMILESCCOc1ccc(Nc2cc(c(N)c3C(=O)c4ccccc4C(=O)c23)S([O-])(=O)=O)cc1