Reaction Details
TargetCocaine esterase
LigandBDBM50371970
Substrate/Competitorn/a
Meas. Tech.ChEMBL_464383 (CHEMBL930032)
IC50 8.5±n/a nM
Citation Wheelock, CENishi, KYing, AJones, PDColvin, MEOlmstead, MMHammock, BD Influence of sulfur oxidation state and steric bulk upon trifluoromethyl ketone (TFK) binding kinetics to carboxylesterases and fatty acid amide hydrolase (FAAH). Bioorg Med Chem16:2114-30 (2008) 
 
Cocaine esterase
Name:Cocaine esterase
Type:PROTEIN
Mol. Mass.:61801.08
Organism:Homo sapiens (Human)
Description:ChEMBL_1494240
Residue:559
BDBM50371970
NameBDBM50371970
Synonyms:CHEMBL89506
TypeSmall organic molecule
Emp. Form.C11H19F3OS
Mol. Mass.256.328
SMILESCCCCCCCCSCC(=O)C(F)(F)F