Reaction Details
TargetMacrophage colony-stimulating factor 1 receptor
LigandBDBM50372158
Substrate/Competitorn/a
Meas. Tech.ChEMBL_464762 (CHEMBL930128)
IC50 2±n/a nM
Citation Dai, YHartandi, KSoni, NBPease, LJReuter, DROlson, AMOsterling, DJDoktor, SZAlbert, DHBouska, JJGlaser, KBMarcotte, PAStewart, KDDavidsen, SKMichaelides, MR Identification of aminopyrazolopyridine ureas as potent VEGFR/PDGFR multitargeted kinase inhibitors. Bioorg Med Chem Lett18:386-90 (2008) 
 
Macrophage colony-stimulating factor 1 receptor
Name:Macrophage colony-stimulating factor 1 receptor
Type:Protein
Mol. Mass.:107979.48
Organism:Homo sapiens (Human)
Description:P07333
Residue:972
BDBM50372158
NameBDBM50372158
Synonyms:CHEMBL404367
TypeSmall organic molecule
Emp. Form.C21H20N6O
Mol. Mass.372.4231
SMILESCc1cccc(NC(=O)Nc2ccc(cc2)-c2cncc3n(C)nc(N)c23)c1