Reaction Details
TargetBeta-secretase 1
LigandBDBM50227347
Substrate/Competitorn/a
Meas. Tech.ChEMBL_464799 (CHEMBL946838)
IC50 130±n/a nM
Citation Iserloh, UWu, YCumming, JNPan, JWang, LYStamford, AWKennedy, MEKuvelkar, RChen, XParker, EMStrickland, CVoigt, J Potent pyrrolidine- and piperidine-based BACE-1 inhibitors. Bioorg Med Chem Lett18:414-7 (2008) 
 
Beta-secretase 1
Name:Beta-secretase 1
Type:Protein
Mol. Mass.:55755.10
Organism:Homo sapiens (Human)
Description:P56817
Residue:501
BDBM50227347
NameBDBM50227347
Synonyms:CHEMBL270153 | N1-((1R,2S)-3-(3,5-difluorophenyl)-1-hydroxy-1-((R)-piperidin-2-yl)propan-2-yl)-5-methyl-N3,N3-dipropylisophthalamide
TypeSmall organic molecule
Emp. Form.C29H39F2N3O3
Mol. Mass.515.6351
SMILESCCCN(CCC)C(=O)c1cc(C)cc(c1)C(=O)N[C@@H](Cc1cc(F)cc(F)c1)[C@H](O)[C@H]1CCCCN1