Reaction Details
TargetBeta-secretase 1
LigandBDBM50372186
Substrate/Competitorn/a
Meas. Tech.ChEMBL_464801 (CHEMBL946840)
IC50 110±n/a nM
Citation Iserloh, UWu, YCumming, JNPan, JWang, LYStamford, AWKennedy, MEKuvelkar, RChen, XParker, EMStrickland, CVoigt, J Potent pyrrolidine- and piperidine-based BACE-1 inhibitors. Bioorg Med Chem Lett18:414-7 (2008) 
 
Beta-secretase 1
Name:Beta-secretase 1
Type:Protein
Mol. Mass.:55755.10
Organism:Homo sapiens (Human)
Description:P56817
Residue:501
BDBM50372186
NameBDBM50372186
Synonyms:CHEMBL257645
TypeSmall organic molecule
Emp. Form.C32H45F2N3O5
Mol. Mass.589.7136
SMILESCCCN(CCC)C(=O)c1cc(C)cc(c1)C(=O)N[C@@H](Cc1cc(F)cc(F)c1)[C@H](O)[C@H]1C[C@H](CCN1)OCCOC