Reaction Details
TargetBeta-secretase 1
LigandBDBM50372183
Substrate/Competitorn/a
Meas. Tech.ChEMBL_464801 (CHEMBL946840)
IC50 2800±n/a nM
Citation Iserloh, UWu, YCumming, JNPan, JWang, LYStamford, AWKennedy, MEKuvelkar, RChen, XParker, EMStrickland, CVoigt, J Potent pyrrolidine- and piperidine-based BACE-1 inhibitors. Bioorg Med Chem Lett18:414-7 (2008) 
 
Beta-secretase 1
Name:Beta-secretase 1
Type:Protein
Mol. Mass.:55755.10
Organism:Homo sapiens (Human)
Description:P56817
Residue:501
BDBM50372183
NameBDBM50372183
Synonyms:CHEMBL272320
TypeSmall organic molecule
Emp. Form.C27H35F2N3O3
Mol. Mass.487.5819
SMILESCCCN(CCC)C(=O)c1cc(C)cc(c1)C(=O)N[C@@H](Cc1cc(F)cc(F)c1)[C@H](O)[C@H]1CCN1