Reaction Details
TargetBeta-secretase 1
LigandBDBM50372182
Substrate/Competitorn/a
Meas. Tech.ChEMBL_464799 (CHEMBL946838)
IC50 89±n/a nM
Citation Iserloh, UWu, YCumming, JNPan, JWang, LYStamford, AWKennedy, MEKuvelkar, RChen, XParker, EMStrickland, CVoigt, J Potent pyrrolidine- and piperidine-based BACE-1 inhibitors. Bioorg Med Chem Lett18:414-7 (2008) 
 
Beta-secretase 1
Name:Beta-secretase 1
Type:Protein
Mol. Mass.:55755.10
Organism:Homo sapiens (Human)
Description:P56817
Residue:501
BDBM50372182
NameBDBM50372182
Synonyms:CHEMBL404680
TypeSmall organic molecule
Emp. Form.C28H37F2N3O4
Mol. Mass.517.6079
SMILESCCCN(CCC)C(=O)c1cc(C)cc(c1)C(=O)N[C@@H](Cc1cc(F)cc(F)c1)[C@H](O)[C@H]1C[C@@H](O)CN1