Reaction Details
TargetBeta-secretase 1
LigandBDBM50372189
Substrate/Competitorn/a
Meas. Tech.ChEMBL_464801 (CHEMBL946840)
IC50 160±n/a nM
Citation Iserloh, UWu, YCumming, JNPan, JWang, LYStamford, AWKennedy, MEKuvelkar, RChen, XParker, EMStrickland, CVoigt, J Potent pyrrolidine- and piperidine-based BACE-1 inhibitors. Bioorg Med Chem Lett18:414-7 (2008) 
 
Beta-secretase 1
Name:Beta-secretase 1
Type:Protein
Mol. Mass.:55755.10
Organism:Homo sapiens (Human)
Description:P56817
Residue:501
BDBM50372189
NameBDBM50372189
Synonyms:CHEMBL399979
TypeSmall organic molecule
Emp. Form.C33H47F2N3O4
Mol. Mass.587.7408
SMILESCCCCO[C@H]1CCN[C@H](C1)[C@@H](O)[C@H](Cc1cc(F)cc(F)c1)NC(=O)c1cc(C)cc(c1)C(=O)N(CCC)CCC