Reaction Details
TargetCathepsin E
LigandBDBM50372198
Substrate/Competitorn/a
Meas. Tech.ChEMBL_464803 (CHEMBL946842)
Ki 5±n/a nM
Citation Iserloh, UWu, YCumming, JNPan, JWang, LYStamford, AWKennedy, MEKuvelkar, RChen, XParker, EMStrickland, CVoigt, J Potent pyrrolidine- and piperidine-based BACE-1 inhibitors. Bioorg Med Chem Lett18:414-7 (2008) 
 
Cathepsin E
Name:Cathepsin E
Type:Enzyme
Mol. Mass.:43298.99
Organism:Homo sapiens (Human)
Description:P14091
Residue:396
BDBM50372198
NameBDBM50372198
Synonyms:CHEMBL270359
TypeSmall organic molecule
Emp. Form.C35H43F2N3O4
Mol. Mass.607.7304
SMILESCCCN(CCC)C(=O)c1cc(C)cc(c1)C(=O)N[C@@H](Cc1cc(F)cc(F)c1)[C@H](O)[C@H]1C[C@H](CN1)OCc1ccccc1