Reaction Details
TargetNitric oxide synthase, inducible
LigandBDBM50063300
Substrate/Competitorn/a
Meas. Tech.ChEMBL_464823 (CHEMBL946893)
IC50 31000±n/a nM
Citation Le Bourdonnec, BLeister, LKAjello, CACassel, JASeida, PRO'Hare, HGu, MChu, GHTuthill, PADeHaven, RNDolle, RE Discovery of a series of aminopiperidines as novel iNOS inhibitors. Bioorg Med Chem Lett18:336-43 (2008) 
 
Nitric oxide synthase, inducible
Name:Nitric oxide synthase, inducible
Type:Homodimer
Mol. Mass.:131141.95
Organism:Homo sapiens (Human)
Description:P35228
Residue:1153
BDBM50063300
NameBDBM50063300
Synonyms:(L-N6-1-iminoethyl)lysine 6-Acetimidoylamino-2-amino-hexanoic acid CHEMBL7889 N~6~-[(1Z)-ethanimidoyl]-L-lysine | l-NIL
TypeSmall organic molecule
Emp. Form.C8H17N3O2
Mol. Mass.187.2395
SMILESCC(N)=NCCCC[C@H](N)C(O)=O