Reaction Details
TargetFatty-acid amide hydrolase 1 [30-579]
LigandBDBM50372355
Substrate/Competitorn/a
Meas. Tech.ChEMBL_464889 (CHEMBL949088)
Ki 0.7±n/a nM
Citation Kimball, FSRomero, FAEzzili, CGarfunkle, JRayl, TJHochstatter, DGHwang, IBoger, DL Optimization of alpha-ketooxazole inhibitors of fatty acid amide hydrolase. J Med Chem51:937-47 (2008) 
 
Fatty-acid amide hydrolase 1 [30-579]
Name:Fatty-acid amide hydrolase 1 [30-579]
Type:Single-pass membrane protein; homodimer
Mol. Mass.:60474.00
Organism:Rattus norvegicus (rat)
Description:P97612 (aa 30-579)
Residue:550
BDBM50372355
NameBDBM50372355
Synonyms:CHEMBL272452
TypeSmall organic molecule
Emp. Form.C19H14F3NO2
Mol. Mass.345.3152
SMILESFC(F)(F)c1cnc(o1)C(=O)CCc1ccc(cc1)-c1ccccc1