Reaction Details
TargetFatty-acid amide hydrolase 1 [30-579]
LigandBDBM23075
Substrate/Competitorn/a
Meas. Tech.ChEMBL_464889 (CHEMBL949088)
Ki 2±n/a nM
Citation Kimball, FSRomero, FAEzzili, CGarfunkle, JRayl, TJHochstatter, DGHwang, IBoger, DL Optimization of alpha-ketooxazole inhibitors of fatty acid amide hydrolase. J Med Chem51:937-47 (2008) 
 
Fatty-acid amide hydrolase 1 [30-579]
Name:Fatty-acid amide hydrolase 1 [30-579]
Type:Single-pass membrane protein; homodimer
Mol. Mass.:60474.00
Organism:Rattus norvegicus (rat)
Description:P97612 (aa 30-579)
Residue:550
BDBM23075
NameBDBM23075
Synonyms:3-[4-(phenylamino)phenyl]-1-[5-(pyridin-2-yl)-1,3-oxazol-2-yl]propan-1-one | alpha-ketooxazole, 11g
TypeSmall organic molecule
Emp. Form.C23H19N3O2
Mol. Mass.369.4159
SMILESO=C(CCc1ccc(Nc2ccccc2)cc1)c1ncc(o1)-c1ccccn1