Reaction Details
TargetFatty-acid amide hydrolase 1
LigandBDBM23073
Substrate/Competitorn/a
Meas. Tech.ChEMBL_464890 (CHEMBL949089)
Ki 5±n/a nM
Citation Kimball, FSRomero, FAEzzili, CGarfunkle, JRayl, TJHochstatter, DGHwang, IBoger, DL Optimization of alpha-ketooxazole inhibitors of fatty acid amide hydrolase. J Med Chem51:937-47 (2008) 
 
Fatty-acid amide hydrolase 1
Name:Fatty-acid amide hydrolase 1
Type:Protein
Mol. Mass.:63071.19
Organism:Homo sapiens (Human)
Description:O00519
Residue:579
BDBM23073
NameBDBM23073
Synonyms:3-[4-(phenoxymethyl)phenyl]-1-[5-(pyridin-2-yl)-1,3-oxazol-2-yl]propan-1-one alpha-ketooxazole, 11e
TypeSmall organic molecule
Emp. Form.C24H20N2O3
Mol. Mass.384.4272
SMILESO=C(CCc1ccc(COc2ccccc2)cc1)c1ncc(o1)-c1ccccn1