Reaction Details
TargetFatty-acid amide hydrolase 1
LigandBDBM50372352
Substrate/Competitorn/a
Meas. Tech.ChEMBL_464890 (CHEMBL949089)
Ki 1.2±n/a nM
Citation Kimball, FSRomero, FAEzzili, CGarfunkle, JRayl, TJHochstatter, DGHwang, IBoger, DL Optimization of alpha-ketooxazole inhibitors of fatty acid amide hydrolase. J Med Chem51:937-47 (2008) 
 
Fatty-acid amide hydrolase 1
Name:Fatty-acid amide hydrolase 1
Type:Protein
Mol. Mass.:63071.19
Organism:Homo sapiens (Human)
Description:O00519
Residue:579
BDBM50372352
NameBDBM50372352
Synonyms:CHEMBL270487
TypeSmall organic molecule
Emp. Form.C25H20N2O4
Mol. Mass.412.4373
SMILESCOC(=O)c1cccc(n1)-c1cnc(o1)C(=O)CCc1ccc(cc1)-c1ccccc1