Reaction Details
TargetFatty-acid amide hydrolase 1 [30-579]
LigandBDBM50204512
Substrate/Competitorn/a
Meas. Tech.ChEMBL_464889 (CHEMBL949088)
IC50 6.5±n/a nM
Citation Kimball, FSRomero, FAEzzili, CGarfunkle, JRayl, TJHochstatter, DGHwang, IBoger, DL Optimization of alpha-ketooxazole inhibitors of fatty acid amide hydrolase. J Med Chem51:937-47 (2008) 
 
Fatty-acid amide hydrolase 1 [30-579]
Name:Fatty-acid amide hydrolase 1 [30-579]
Type:Single-pass membrane protein; homodimer
Mol. Mass.:60474.00
Organism:Rattus norvegicus (rat)
Description:P97612 (aa 30-579)
Residue:550
BDBM50204512
NameBDBM50204512
Synonyms:2-(7-phenylheptanoyl)oxazole-5-carbonitrile | CHEMBL220770
TypeSmall organic molecule
Emp. Form.C17H18N2O2
Mol. Mass.282.337
SMILESO=C(CCCCCCc1ccccc1)c1ncc(o1)C#N