Reaction Details
TargetLiver carboxylesterase 1
LigandBDBM50204512
Substrate/Competitorn/a
Meas. Tech.ChEMBL_464891 (CHEMBL949090)
IC50 20±n/a nM
Citation Kimball, FSRomero, FAEzzili, CGarfunkle, JRayl, TJHochstatter, DGHwang, IBoger, DL Optimization of alpha-ketooxazole inhibitors of fatty acid amide hydrolase. J Med Chem51:937-47 (2008) 
 
Liver carboxylesterase 1
Name:Liver carboxylesterase 1
Type:Protein
Mol. Mass.:62520.83
Organism:Homo sapiens (Human)
Description:n/a
Residue:567
BDBM50204512
NameBDBM50204512
Synonyms:2-(7-phenylheptanoyl)oxazole-5-carbonitrile | CHEMBL220770
TypeSmall organic molecule
Emp. Form.C17H18N2O2
Mol. Mass.282.337
SMILESO=C(CCCCCCc1ccccc1)c1ncc(o1)C#N