Reaction Details
TargetCoagulation factor X
LigandBDBM50372527
Substrate/Competitorn/a
Meas. Tech.ChEMBL_465205 (CHEMBL931789)
IC50 33±n/a nM
Citation Imaeda, YMiyawaki, TSakamoto, HItoh, FKonishi, NHiroe, KKawamura, MTanaka, TKubo, K Discovery of sulfonylalkylamides: A new class of orally active factor Xa inhibitors. Bioorg Med Chem16:2243-60 (2008) 
 
Coagulation factor X
Name:Coagulation factor X
Type:Enzyme
Mol. Mass.:54726.60
Organism:Homo sapiens (Human)
Description:n/a
Residue:488
BDBM50372527
NameBDBM50372527
Synonyms:CHEMBL270527
TypeSmall organic molecule
Emp. Form.C25H27ClN4O3S
Mol. Mass.499.025
SMILESClc1ccc2cc(ccc2c1)S(=O)(=O)N1CCN(CC1)C(=O)C1CCN(CC1)c1ccncc1