Reaction Details
TargetCoagulation factor X
LigandBDBM50372548
Substrate/Competitorn/a
Meas. Tech.ChEMBL_465205 (CHEMBL931789)
IC50 50±n/a nM
Citation Imaeda, YMiyawaki, TSakamoto, HItoh, FKonishi, NHiroe, KKawamura, MTanaka, TKubo, K Discovery of sulfonylalkylamides: A new class of orally active factor Xa inhibitors. Bioorg Med Chem16:2243-60 (2008) 
 
Coagulation factor X
Name:Coagulation factor X
Type:Enzyme
Mol. Mass.:54726.60
Organism:Homo sapiens (Human)
Description:n/a
Residue:488
BDBM50372548
NameBDBM50372548
Synonyms:CHEMBL271991
TypeSmall organic molecule
Emp. Form.C24H26ClN3O3S
Mol. Mass.472
SMILESCN(C1CCN(CC1)c1ccncc1)C(=O)CCS(=O)(=O)c1ccc2cc(Cl)ccc2c1