Reaction Details
TargetAdenosine receptor A2a
LigandBDBM50372565
Substrate/Competitorn/a
Meas. Tech.ChEMBL_465258 (CHEMBL930529)
Ki 3±n/a nM
Citation Moorjani, MZhang, XChen, YLin, ERueter, JKGross, RSLanier, MCTellew, JEWilliams, JPLechner, SMMalany, SSantos, MEkhlassi, PCastro-Palomino, JCCrespo, MIPrat, MGual, SDíaz, JLSaunders, JSlee, DH 2,6-Diaryl-4-phenacylaminopyrimidines as potent and selective adenosine A(2A) antagonists with reduced hERG liability. Bioorg Med Chem Lett18:1269-73 (2008) 
 
Adenosine receptor A2a
Name:Adenosine receptor A2a
Type:G Protein-Coupled Receptor (GPCR)
Mol. Mass.:44716.46
Organism:Homo sapiens (Human)
Description:P29274
Residue:412
BDBM50372565
NameBDBM50372565
Synonyms:CHEMBL401865
TypeSmall organic molecule
Emp. Form.C24H25N5O3
Mol. Mass.431.487
SMILESCOc1ccc(CC(=O)Nc2cc(nc(n2)-c2ccc(C)o2)-n2nc(C)cc2C)cc1C