Reaction Details
TargetAdenosine receptor A2a
LigandBDBM50372573
Substrate/Competitorn/a
Meas. Tech.ChEMBL_465258 (CHEMBL930529)
Ki 1±n/a nM
Citation Moorjani, MZhang, XChen, YLin, ERueter, JKGross, RSLanier, MCTellew, JEWilliams, JPLechner, SMMalany, SSantos, MEkhlassi, PCastro-Palomino, JCCrespo, MIPrat, MGual, SDíaz, JLSaunders, JSlee, DH 2,6-Diaryl-4-phenacylaminopyrimidines as potent and selective adenosine A(2A) antagonists with reduced hERG liability. Bioorg Med Chem Lett18:1269-73 (2008) 
 
Adenosine receptor A2a
Name:Adenosine receptor A2a
Type:G Protein-Coupled Receptor (GPCR)
Mol. Mass.:44716.46
Organism:Homo sapiens (Human)
Description:P29274
Residue:412
BDBM50372573
NameBDBM50372573
Synonyms:CHEMBL270655
TypeSmall organic molecule
Emp. Form.C25H26N6O3
Mol. Mass.458.5123
SMILESCCOc1ccc(CC(=O)Nc2cc(nc(n2)-c2ccccn2)-n2nc(C)cc2C)cc1OC