Reaction Details
TargetCarbonic anhydrase 9
LigandBDBM10883
Substrate/Competitorn/a
Meas. Tech.ChEMBL_465607 (CHEMBL951057)
Ki 50±n/a nM
Citation Wilkinson, BLInnocenti, AVullo, DSupuran, CTPoulsen, SA Inhibition of carbonic anhydrases with glycosyltriazole benzene sulfonamides. J Med Chem51:1945-53 (2008) 
 
Carbonic anhydrase 9
Name:Carbonic anhydrase 9
Type:Enzyme
Mol. Mass.:49669.03
Organism:Homo sapiens (Human)
Description:Catalytic domain of human cloned isozyme was used in the assay
Residue:459
BDBM10883
NameBDBM10883
Synonyms:4,5-dichlorobenzene-1,3-disulfonamide Dichlorophenamide Dichlorophenamide, DCP US10172837, Dichlorphenamide | sulfonamide 4
TypeSmall organic molecule
Emp. Form.C6H6Cl2N2O4S2
Mol. Mass.305.159
SMILESNS(=O)(=O)c1cc(Cl)c(Cl)c(c1)S(N)(=O)=O