Reaction Details
TargetMetabotropic glutamate receptor 2
LigandBDBM50372871
Substrate/Competitorn/a
Meas. Tech.ChEMBL_465959 (CHEMBL947083)
IC50 9±n/a nM
Citation Woltering, TJAdam, GWichmann, JGoetschi, EKew, JNKnoflach, FMutel, VGatti, S Synthesis and characterization of 8-ethynyl-1,3-dihydro-benzo[b][1,4]diazepin-2-one derivatives: part 2. New potent non-competitive metabotropic glutamate receptor 2/3 antagonists. Bioorg Med Chem Lett18:1091-5 (2008) 
 
Metabotropic glutamate receptor 2
Name:Metabotropic glutamate receptor 2
Type:Enzyme
Mol. Mass.:95584.88
Organism:Homo sapiens (Human)
Description:Q14416
Residue:872
BDBM50372871
NameBDBM50372871
Synonyms:CHEMBL256011
TypeSmall organic molecule
Emp. Form.C26H17FN4O
Mol. Mass.420.4378
SMILESFc1ccc(cc1)C#Cc1ccc2N=C(CC(=O)Nc2c1)c1cccc(c1)-n1ccnc1