Reaction Details
TargetMetabotropic glutamate receptor 2
LigandBDBM50372880
Substrate/Competitorn/a
Meas. Tech.ChEMBL_465958 (CHEMBL947082)
IC50 13±n/a nM
Citation Woltering, TJAdam, GWichmann, JGoetschi, EKew, JNKnoflach, FMutel, VGatti, S Synthesis and characterization of 8-ethynyl-1,3-dihydro-benzo[b][1,4]diazepin-2-one derivatives: part 2. New potent non-competitive metabotropic glutamate receptor 2/3 antagonists. Bioorg Med Chem Lett18:1091-5 (2008) 
 
Metabotropic glutamate receptor 2
Name:Metabotropic glutamate receptor 2
Type:Enzyme
Mol. Mass.:95584.88
Organism:Homo sapiens (Human)
Description:Q14416
Residue:872
BDBM50372880
NameBDBM50372880
Synonyms:CHEMBL402886
TypeSmall organic molecule
Emp. Form.C26H18N4O
Mol. Mass.402.4473
SMILESO=C1CC(=Nc2ccc(cc2N1)C#Cc1ccccc1)c1cccc(c1)-n1ccnc1