Reaction Details
TargetMetabotropic glutamate receptor 2
LigandBDBM50372881
Substrate/Competitorn/a
Meas. Tech.ChEMBL_465958 (CHEMBL947082)
IC50 6±n/a nM
Citation Woltering, TJAdam, GWichmann, JGoetschi, EKew, JNKnoflach, FMutel, VGatti, S Synthesis and characterization of 8-ethynyl-1,3-dihydro-benzo[b][1,4]diazepin-2-one derivatives: part 2. New potent non-competitive metabotropic glutamate receptor 2/3 antagonists. Bioorg Med Chem Lett18:1091-5 (2008) 
 
Metabotropic glutamate receptor 2
Name:Metabotropic glutamate receptor 2
Type:Enzyme
Mol. Mass.:95584.88
Organism:Homo sapiens (Human)
Description:Q14416
Residue:872
BDBM50372881
NameBDBM50372881
Synonyms:CHEMBL256812
TypeSmall organic molecule
Emp. Form.C25H16FN5O
Mol. Mass.421.4258
SMILESFc1ccc(cc1)C#Cc1ccc2N=C(CC(=O)Nc2c1)c1cccc(c1)-n1ccnn1