Reaction Details
TargetGlucocorticoid receptor
LigandBDBM50372927
Substrate/Competitorn/a
Meas. Tech.ChEMBL_466158 (CHEMBL950162)
Ki 1.4±n/a nM
Citation Clark, RDRay, NCWilliams, KBlaney, PWard, SCrackett, PHHurley, CDyke, HJClark, DELockey, PDevos, RWong, MPorres, SSBright, CPJenkins, REBelanoff, J 1H-Pyrazolo[3,4-g]hexahydro-isoquinolines as selective glucocorticoid receptor antagonists with high functional activity. Bioorg Med Chem Lett18:1312-7 (2008) 
 
Glucocorticoid receptor
Name:Glucocorticoid receptor
Type:Enzyme
Mol. Mass.:85656.87
Organism:Homo sapiens (Human)
Description:P04150
Residue:777
BDBM50372927
NameBDBM50372927
Synonyms:CHEMBL256161
TypeSmall organic molecule
Emp. Form.C33H34FN3O2S
Mol. Mass.555.705
SMILESCC(C)(C)c1ccc(cc1)S(=O)(=O)N1CCC2=Cc3c(C[C@]2(Cc2ccccc2)C1)cnn3-c1ccc(F)cc1