Reaction Details
TargetGlucocorticoid receptor
LigandBDBM50372960
Substrate/Competitorn/a
Meas. Tech.ChEMBL_466158 (CHEMBL950162)
Ki 1.4±n/a nM
Citation Clark, RDRay, NCWilliams, KBlaney, PWard, SCrackett, PHHurley, CDyke, HJClark, DELockey, PDevos, RWong, MPorres, SSBright, CPJenkins, REBelanoff, J 1H-Pyrazolo[3,4-g]hexahydro-isoquinolines as selective glucocorticoid receptor antagonists with high functional activity. Bioorg Med Chem Lett18:1312-7 (2008) 
 
Glucocorticoid receptor
Name:Glucocorticoid receptor
Type:Enzyme
Mol. Mass.:85656.87
Organism:Homo sapiens (Human)
Description:P04150
Residue:777
BDBM50372960
NameBDBM50372960
Synonyms:CHEMBL272788
TypeSmall organic molecule
Emp. Form.C29H24F3N3O2S
Mol. Mass.535.58
SMILESFc1ccc(CC23CN(CCC2=Cc2c(C3)cnn2-c2ccc(F)cc2)S(=O)(=O)c2ccc(F)cc2)cc1