Reaction Details
TargetGlucocorticoid receptor
LigandBDBM50372929
Substrate/Competitorn/a
Meas. Tech.ChEMBL_466159 (CHEMBL950163)
Ki 7.1±n/a nM
Citation Clark, RDRay, NCWilliams, KBlaney, PWard, SCrackett, PHHurley, CDyke, HJClark, DELockey, PDevos, RWong, MPorres, SSBright, CPJenkins, REBelanoff, J 1H-Pyrazolo[3,4-g]hexahydro-isoquinolines as selective glucocorticoid receptor antagonists with high functional activity. Bioorg Med Chem Lett18:1312-7 (2008) 
 
Glucocorticoid receptor
Name:Glucocorticoid receptor
Type:Enzyme
Mol. Mass.:85656.87
Organism:Homo sapiens (Human)
Description:P04150
Residue:777
BDBM50372929
NameBDBM50372929
Synonyms:CHEMBL270838
TypeSmall organic molecule
Emp. Form.C31H37FN4O3S
Mol. Mass.564.714
SMILESCC(C)(C)c1ccc(cc1)S(=O)(=O)N1CCC2=Cc3c(C[C@]2(CN2CCOCC2)C1)cnn3-c1ccc(F)cc1