Reaction Details
TargetGlycogen synthase kinase-3 beta
LigandBDBM50373018
Substrate/Competitorn/a
Meas. Tech.ChEMBL_466245 (CHEMBL951013)
IC50 23±n/a nM
Citation Miyazaki, YMaeda, YSato, HNakano, MMellor, GW Rational design of 4-amino-5,6-diaryl-furo[2,3-d]pyrimidines as potent glycogen synthase kinase-3 inhibitors. Bioorg Med Chem Lett18:1967-71 (2008) 
 
Glycogen synthase kinase-3 beta
Name:Glycogen synthase kinase-3 beta
Type:Enzyme
Mol. Mass.:46756.38
Organism:Homo sapiens (Human)
Description:P49841
Residue:420
BDBM50373018
NameBDBM50373018
Synonyms:CHEMBL404507
TypeSmall organic molecule
Emp. Form.C21H15N5O3S2
Mol. Mass.449.506
SMILESNc1ncnc2oc(c(-c3ccc(NS(=O)(=O)c4cccs4)cc3)c12)-c1cccnc1