Reaction Details
TargetPeroxisome proliferator-activated receptor alpha
LigandBDBM28700
Substrate/Competitorn/a
Meas. Tech.ChEMBL_466273 (CHEMBL950102)
EC50 30000±n/a nM
Citation Aoki, TAsaki, THamamoto, TSugiyama, YOhmachi, SKuwabara, KMurakami, KTodo, M Discovery of a novel class of 1,3-dioxane-2-carboxylic acid derivatives as subtype-selective peroxisome proliferator-activated receptor alpha (PPARalpha) agonists. Bioorg Med Chem Lett18:2128-32 (2008) 
 
Peroxisome proliferator-activated receptor alpha
Name:Peroxisome proliferator-activated receptor alpha
Type:Enzyme
Mol. Mass.:52222.08
Organism:Homo sapiens (Human)
Description:Q07869
Residue:468
BDBM28700
NameBDBM28700
Synonyms:2-(4-(4-Chlorobenzoyl)phenoxy)-2-methylpropionic acid CHEMBL981 FIBRICOR LF 153 procetofenic acid
TypeSmall organic molecule
Emp. Form.C17H15ClO4
Mol. Mass.318.752
SMILESCC(C)(Oc1ccc(cc1)C(=O)c1ccc(Cl)cc1)C(O)=O