Reaction Details
TargetTranslocator protein
LigandBDBM50054126
Substrate/Competitorn/a
Meas. Tech.ChEMBL_466367 (CHEMBL932479)
IC50 0.62±n/a nM
Citation Cappelli, AGiuliani, GValenti, SAnzini, MVomero, SGiorgi, GSogliano, CMaciocco, EBiggio, GConcas, A Synthesis and structure-activity relationship studies in peripheral benzodiazepine receptor ligands related to alpidem. Bioorg Med Chem16:3428-37 (2008) 
 
Translocator protein
Name:Translocator protein
Type:Mitochondrion membrane protein
Mol. Mass.:18945.84
Organism:Rattus norvegicus (rat)
Description:Competitive binding experiments were performed on rat kidney mitochondrial membranes.
Residue:169
BDBM50054126
NameBDBM50054126
Synonyms:(E)-N-(4-chlorophenyl)-2-(2-(4-chlorophenyl)-1-oxo-1,2-dihydropyrrolo[3,4-b]quinolin-3-ylidene)-N-methylacetamide N-(4-Chloro-phenyl)-2-[2-(4-chloro-phenyl)-1-oxo-1,2-dihydro-pyrrolo[3,4-b]quinolin-(3E)-ylidene]-N-methyl-acetamide
TypeSmall organic molecule
Emp. Form.C26H17Cl2N3O2
Mol. Mass.474.338
SMILESCN(C(=O)\C=C1\N(C(=O)c2cc3ccccc3nc12)c1ccc(Cl)cc1)c1ccc(Cl)cc1