Reaction Details
TargetFarnesyl pyrophosphate synthase
LigandBDBM12581
Substrate/Competitorn/a
Meas. Tech.ChEMBL_466619 (CHEMBL924793)
IC50 1932±n/a nM
Citation Dunford, JEKwaasi, AARogers, MJBarnett, BLEbetino, FHRussell, RGOppermann, UKavanagh, KL Structure-activity relationships among the nitrogen containing bisphosphonates in clinical use and other analogues: time-dependent inhibition of human farnesyl pyrophosphate synthase. J Med Chem51:2187-95 (2008) 
 
Farnesyl pyrophosphate synthase
Name:Farnesyl pyrophosphate synthase
Type:Enzyme
Mol. Mass.:48272.89
Organism:Homo sapiens (Human)
Description:P14324
Residue:419
BDBM12581
NameBDBM12581
Synonyms:(3-amino-1-hydroxy-1-phosphonopropyl)phosphonic acid CHEMBL834 | JMC515594 Compound 62
TypeSmall organic molecule
Emp. Form.C3H11NO7P2
Mol. Mass.235.0695
SMILESNCCC(O)(P(O)(O)=O)P(O)(O)=O