Reaction Details
TargetFarnesyl pyrophosphate synthase
LigandBDBM50173792
Substrate/Competitorn/a
Meas. Tech.ChEMBL_466619 (CHEMBL924793)
IC50 370.7±n/a nM
Citation Dunford, JEKwaasi, AARogers, MJBarnett, BLEbetino, FHRussell, RGOppermann, UKavanagh, KL Structure-activity relationships among the nitrogen containing bisphosphonates in clinical use and other analogues: time-dependent inhibition of human farnesyl pyrophosphate synthase. J Med Chem51:2187-95 (2008) 
 
Farnesyl pyrophosphate synthase
Name:Farnesyl pyrophosphate synthase
Type:Enzyme
Mol. Mass.:48272.89
Organism:Homo sapiens (Human)
Description:P14324
Residue:419
BDBM50173792
NameBDBM50173792
Synonyms:2-(2-aminophenyl)-1-hydroxyethane-1,1-diyldiphosphonic acid [2-(2-amino-phenyl)-1-hydroxy-1-phosphono-ethyl]-phosphonic acid | hydrogen [2-(2-azaniumylphenyl)-1-hydroxy-1-phosphonatoethyl]phosphonate
TypeSmall organic molecule
Emp. Form.C8H13NO7P2
Mol. Mass.297.1388
SMILESNc1ccccc1CC(O)(P(O)(O)=O)P(O)(O)=O