Reaction Details
TargetFarnesyl pyrophosphate synthase
LigandBDBM12577
Substrate/Competitorn/a
Meas. Tech.ChEMBL_466619 (CHEMBL924793)
IC50 1052±n/a nM
Citation Dunford, JEKwaasi, AARogers, MJBarnett, BLEbetino, FHRussell, RGOppermann, UKavanagh, KL Structure-activity relationships among the nitrogen containing bisphosphonates in clinical use and other analogues: time-dependent inhibition of human farnesyl pyrophosphate synthase. J Med Chem51:2187-95 (2008) 
 
Farnesyl pyrophosphate synthase
Name:Farnesyl pyrophosphate synthase
Type:Enzyme
Mol. Mass.:48272.89
Organism:Homo sapiens (Human)
Description:P14324
Residue:419
BDBM12577
NameBDBM12577
Synonyms:Bisphosphonate 2 JMC515594 Compound 53 | {1-hydroxy-3-[methyl(pentyl)amino]-1-phosphonopropyl}phosphonic acid
TypeSmall organic molecule
Emp. Form.C9H23NO7P2
Mol. Mass.319.2289
SMILESCCCCCN(C)CCC(O)(P(O)(O)=O)P(O)(O)=O