Reaction Details
TargetFarnesyl pyrophosphate synthase
LigandBDBM50115106
Substrate/Competitorn/a
Meas. Tech.ChEMBL_466620 (CHEMBL924794)
IC50 15±n/a nM
Citation Dunford, JEKwaasi, AARogers, MJBarnett, BLEbetino, FHRussell, RGOppermann, UKavanagh, KL Structure-activity relationships among the nitrogen containing bisphosphonates in clinical use and other analogues: time-dependent inhibition of human farnesyl pyrophosphate synthase. J Med Chem51:2187-95 (2008) 
 
Farnesyl pyrophosphate synthase
Name:Farnesyl pyrophosphate synthase
Type:Enzyme
Mol. Mass.:48272.89
Organism:Homo sapiens (Human)
Description:P14324
Residue:419
BDBM50115106
NameBDBM50115106
Synonyms:2-(pyridin-2-ylamino)ethane-1,1-diyldiphosphonic acid [1-Phosphono-2-(pyridin-2-ylamino)-ethyl]-phosphonic acid(NE11808) [2-(2-pyridinylamino)ethylidene]-1,1-bisphosphonate | [2-(PYRIDIN-2-YLAMINO)ETHANE-1,1-DIYL]BIS(PHOSPHONIC ACID)
TypeSmall organic molecule
Emp. Form.C7H12N2O6P2
Mol. Mass.282.1275
SMILESOP(O)(=O)C(CNc1ccccn1)P(O)(O)=O