Reaction Details
TargetFarnesyl pyrophosphate synthase
LigandBDBM50373099
Substrate/Competitorn/a
Meas. Tech.ChEMBL_466620 (CHEMBL924794)
Ki 3.9±n/a nM
Citation Dunford, JEKwaasi, AARogers, MJBarnett, BLEbetino, FHRussell, RGOppermann, UKavanagh, KL Structure-activity relationships among the nitrogen containing bisphosphonates in clinical use and other analogues: time-dependent inhibition of human farnesyl pyrophosphate synthase. J Med Chem51:2187-95 (2008) 
 
Farnesyl pyrophosphate synthase
Name:Farnesyl pyrophosphate synthase
Type:Enzyme
Mol. Mass.:48272.89
Organism:Homo sapiens (Human)
Description:P14324
Residue:419
BDBM50373099
NameBDBM50373099
Synonyms:CHEMBL99553 | NE-10575
TypeSmall organic molecule
Emp. Form.C8H14NO7P2
Mol. Mass.298.1462
SMILESC[n+]1cccc(CC(O)(P(O)(O)=O)P(O)(O)=O)c1