Reaction Details
TargetFarnesyl pyrophosphate synthase
LigandBDBM50373095
Substrate/Competitorn/a
Meas. Tech.ChEMBL_466619 (CHEMBL924793)
IC50 988.6±n/a nM
Citation Dunford, JEKwaasi, AARogers, MJBarnett, BLEbetino, FHRussell, RGOppermann, UKavanagh, KL Structure-activity relationships among the nitrogen containing bisphosphonates in clinical use and other analogues: time-dependent inhibition of human farnesyl pyrophosphate synthase. J Med Chem51:2187-95 (2008) 
 
Farnesyl pyrophosphate synthase
Name:Farnesyl pyrophosphate synthase
Type:Enzyme
Mol. Mass.:48272.89
Organism:Homo sapiens (Human)
Description:P14324
Residue:419
BDBM50373095
NameBDBM50373095
Synonyms:CHEMBL98719
TypeSmall organic molecule
Emp. Form.C8H14N2O6P2
Mol. Mass.296.1541
SMILESCc1cccnc1NCC(P(O)(O)=O)P(O)(O)=O