Reaction Details
TargetMitogen-activated protein kinase 8
LigandBDBM50373215
Substrate/Competitorn/a
Meas. Tech.ChEMBL_467340 (CHEMBL934566)
IC50 2.6±n/a nM
Citation Asano, YKitamura, SOhra, TAso, KIgata, HTamura, TKawamoto, TTanaka, TSogabe, SMatsumoto, SYamaguchi, MKimura, HItoh, F Discovery, synthesis and biological evaluation of isoquinolones as novel and highly selective JNK inhibitors (1). Bioorg Med Chem16:4715-32 (2008) 
 
Mitogen-activated protein kinase 8
Name:Mitogen-activated protein kinase 8
Type:PROTEIN
Mol. Mass.:46809.57
Organism:Rattus norvegicus
Description:ChEMBL_475208
Residue:411
BDBM50373215
NameBDBM50373215
Synonyms:CHEMBL259060
TypeSmall organic molecule
Emp. Form.C25H20BrNO5S
Mol. Mass.526.399
SMILESCOC(=O)c1c(-c2ccccc2)c2cc(Br)ccc2c(=O)n1Cc1ccc(cc1)S(C)(=O)=O