Reaction Details
TargetMitogen-activated protein kinase 9
LigandBDBM50373215
Substrate/Competitorn/a
Meas. Tech.ChEMBL_467350 (CHEMBL934576)
IC50 34±n/a nM
Citation Asano, YKitamura, SOhra, TAso, KIgata, HTamura, TKawamoto, TTanaka, TSogabe, SMatsumoto, SYamaguchi, MKimura, HItoh, F Discovery, synthesis and biological evaluation of isoquinolones as novel and highly selective JNK inhibitors (1). Bioorg Med Chem16:4715-32 (2008) 
 
Mitogen-activated protein kinase 9
Name:Mitogen-activated protein kinase 9
Type:Enzyme
Mol. Mass.:48131.49
Organism:Homo sapiens (Human)
Description:JNK-2 was purchased from Upstate Cell Signaling Solutions (formerly Upstate Biotechnology).
Residue:424
BDBM50373215
NameBDBM50373215
Synonyms:CHEMBL259060
TypeSmall organic molecule
Emp. Form.C25H20BrNO5S
Mol. Mass.526.399
SMILESCOC(=O)c1c(-c2ccccc2)c2cc(Br)ccc2c(=O)n1Cc1ccc(cc1)S(C)(=O)=O