Reaction Details
TargetP2Y purinoceptor 1
LigandBDBM50373288
Substrate/Competitorn/a
Meas. Tech.ChEMBL_467631 (CHEMBL930506)
Ki 290±n/a nM
Citation Pfefferkorn, JAChoi, CWinters, TKennedy, RChi, LPerrin, LALu, GPing, YWMcClanahan, TSchroeder, RLeininger, MTGeyer, ASchefzick, SAtherton, J P2Y1 receptor antagonists as novel antithrombotic agents. Bioorg Med Chem Lett18:3338-43 (2008) 
 
P2Y purinoceptor 1
Name:P2Y purinoceptor 1
Type:Enzyme
Mol. Mass.:42090.25
Organism:Homo sapiens (Human)
Description:P47900
Residue:373
BDBM50373288
NameBDBM50373288
Synonyms:CHEMBL403555
TypeSmall organic molecule
Emp. Form.C24H19F3N4O3
Mol. Mass.468.4279
SMILESCc1cc(Oc2ccccc2NC(=O)Nc2ccc(OC(F)(F)F)cc2)n(n1)-c1ccccc1