Reaction Details
TargetP2Y purinoceptor 1
LigandBDBM50373291
Substrate/Competitorn/a
Meas. Tech.ChEMBL_467631 (CHEMBL930506)
Ki>10000±n/a nM
Citation Pfefferkorn, JAChoi, CWinters, TKennedy, RChi, LPerrin, LALu, GPing, YWMcClanahan, TSchroeder, RLeininger, MTGeyer, ASchefzick, SAtherton, J P2Y1 receptor antagonists as novel antithrombotic agents. Bioorg Med Chem Lett18:3338-43 (2008) 
 
P2Y purinoceptor 1
Name:P2Y purinoceptor 1
Type:Enzyme
Mol. Mass.:42090.25
Organism:Homo sapiens (Human)
Description:P47900
Residue:373
BDBM50373291
NameBDBM50373291
Synonyms:CHEMBL255252
TypeSmall organic molecule
Emp. Form.C23H18F3N5O3
Mol. Mass.469.4159
SMILESCc1cc(Oc2ccncc2NC(=O)Nc2ccc(OC(F)(F)F)cc2)n(n1)-c1ccccc1