Reaction Details
TargetP2Y purinoceptor 1
LigandBDBM50373293
Substrate/Competitorn/a
Meas. Tech.ChEMBL_467631 (CHEMBL930506)
Ki 70±n/a nM
Citation Pfefferkorn, JAChoi, CWinters, TKennedy, RChi, LPerrin, LALu, GPing, YWMcClanahan, TSchroeder, RLeininger, MTGeyer, ASchefzick, SAtherton, J P2Y1 receptor antagonists as novel antithrombotic agents. Bioorg Med Chem Lett18:3338-43 (2008) 
 
P2Y purinoceptor 1
Name:P2Y purinoceptor 1
Type:Enzyme
Mol. Mass.:42090.25
Organism:Homo sapiens (Human)
Description:P47900
Residue:373
BDBM50373293
NameBDBM50373293
Synonyms:CHEMBL255307
TypeSmall organic molecule
Emp. Form.C25H22F3N5O3
Mol. Mass.497.4691
SMILESCCc1ccccc1-n1nc(C)cc1Oc1ncccc1NC(=O)Nc1ccc(OC(F)(F)F)cc1