Reaction Details
TargetP2Y purinoceptor 1
LigandBDBM50373304
Substrate/Competitorn/a
Meas. Tech.ChEMBL_467631 (CHEMBL930506)
Ki 10±n/a nM
Citation Pfefferkorn, JAChoi, CWinters, TKennedy, RChi, LPerrin, LALu, GPing, YWMcClanahan, TSchroeder, RLeininger, MTGeyer, ASchefzick, SAtherton, J P2Y1 receptor antagonists as novel antithrombotic agents. Bioorg Med Chem Lett18:3338-43 (2008) 
 
P2Y purinoceptor 1
Name:P2Y purinoceptor 1
Type:Enzyme
Mol. Mass.:42090.25
Organism:Homo sapiens (Human)
Description:P47900
Residue:373
BDBM50373304
NameBDBM50373304
Synonyms:CHEMBL255724
TypeSmall organic molecule
Emp. Form.C31H34N4O2
Mol. Mass.494.6273
SMILESCCc1ccccc1-n1nc(C)cc1Oc1ccccc1NC(=O)Nc1ccc(cc1)C1CCCCC1