Reaction Details
TargetP2Y purinoceptor 1
LigandBDBM50373307
Substrate/Competitorn/a
Meas. Tech.ChEMBL_467631 (CHEMBL930506)
Ki 60±n/a nM
Citation Pfefferkorn, JAChoi, CWinters, TKennedy, RChi, LPerrin, LALu, GPing, YWMcClanahan, TSchroeder, RLeininger, MTGeyer, ASchefzick, SAtherton, J P2Y1 receptor antagonists as novel antithrombotic agents. Bioorg Med Chem Lett18:3338-43 (2008) 
 
P2Y purinoceptor 1
Name:P2Y purinoceptor 1
Type:Enzyme
Mol. Mass.:42090.25
Organism:Homo sapiens (Human)
Description:P47900
Residue:373
BDBM50373307
NameBDBM50373307
Synonyms:CHEMBL402837
TypeSmall organic molecule
Emp. Form.C26H23F3N4O2
Mol. Mass.480.4816
SMILESCCc1ccccc1-n1nc(C)cc1Oc1ccccc1NC(=O)Nc1ccc(cc1)C(F)(F)F