Reaction Details
TargetNeuropeptide Y receptor type 5
LigandBDBM50373625
Substrate/Competitorn/a
Meas. Tech.ChEMBL_468024 (CHEMBL948247)
Ki 1.5±n/a nM
Citation Li, GStamford, AWHuang, YCheng, KCCook, JFarley, CGao, JGhibaudi, LGreenlee, WJGuzzi, Mvan Heek, MHwa, JJKelly, JMullins, DParker, EMWainhaus, SZhang, X Discovery of novel orally active ureido NPY Y5 receptor antagonists. Bioorg Med Chem Lett18:1146-50 (2008) 
 
Neuropeptide Y receptor type 5
Name:Neuropeptide Y receptor type 5
Type:Enzyme
Mol. Mass.:50746.64
Organism:Homo sapiens (Human)
Description:Q15761
Residue:445
BDBM50373625
NameBDBM50373625
Synonyms:CHEMBL403918
TypeSmall organic molecule
Emp. Form.C22H31F2N3O2
Mol. Mass.407.4972
SMILESCCC(=O)N1CCC(CC1)N(C)C(=O)N[C@H]1CC[C@@H](CC1)c1cc(F)cc(F)c1