Reaction Details
TargetNeuropeptide Y receptor type 5
LigandBDBM50373652
Substrate/Competitorn/a
Meas. Tech.ChEMBL_468024 (CHEMBL948247)
Ki 7.4±n/a nM
Citation Li, GStamford, AWHuang, YCheng, KCCook, JFarley, CGao, JGhibaudi, LGreenlee, WJGuzzi, Mvan Heek, MHwa, JJKelly, JMullins, DParker, EMWainhaus, SZhang, X Discovery of novel orally active ureido NPY Y5 receptor antagonists. Bioorg Med Chem Lett18:1146-50 (2008) 
 
Neuropeptide Y receptor type 5
Name:Neuropeptide Y receptor type 5
Type:Enzyme
Mol. Mass.:50746.64
Organism:Homo sapiens (Human)
Description:Q15761
Residue:445
BDBM50373652
NameBDBM50373652
Synonyms:CHEMBL401726
TypeSmall organic molecule
Emp. Form.C20H28F2N4O2
Mol. Mass.394.4587
SMILESCN(C1CCN(CC1)C(C)=O)C(=O)NC1CCN(CC1)c1cc(F)cc(F)c1