Reaction Details
TargetNeprilysin
LigandBDBM50373660
Substrate/Competitorn/a
Meas. Tech.ChEMBL_468058 (CHEMBL930674)
IC50 8±n/a nM
Citation Hanessian, SGuesné, SRiber, LMarin, JBenoist, AMennecier, PRupin, AVerbeuren, TJDe Nanteuil, G Targeting ACE and ECE with dual acting inhibitors. Bioorg Med Chem Lett18:1058-62 (2008) 
 
Neprilysin
Name:Neprilysin
Type:Enzyme
Mol. Mass.:85505.38
Organism:Homo sapiens (Human)
Description:P08473
Residue:750
BDBM50373660
NameBDBM50373660
Synonyms:CHEMBL255568
TypeSmall organic molecule
Emp. Form.C19H25N3O6
Mol. Mass.391.4183
SMILESCC(C)CN(C[C@H](O)C(O)=O)C(=O)N[C@@H](Cc1c[nH]c2ccccc12)C(O)=O