Reaction Details
TargetGlutamate receptor 1
LigandBDBM50373889
Substrate/Competitorn/a
Meas. Tech.ChEMBL_468625 (CHEMBL934442)
Ki 150±n/a nM
Citation Beich-Frandsen, MPickering, DSMirza, OJohansen, TNGreenwood, JVestergaard, BSchousboe, AGajhede, MLiljefors, TKastrup, JS Structures of the ligand-binding core of iGluR2 in complex with the agonists (R)- and (S)-2-amino-3-(4-hydroxy-1,2,5-thiadiazol-3-yl)propionic acid explain their unusual equipotency. J Med Chem51:1459-63 (2008) 
 
Glutamate receptor 1
Name:Glutamate receptor 1
Type:Enzyme Catalytic Domain
Mol. Mass.:101512.92
Organism:Homo sapiens (Human)
Description:Glutamate AMPA 1 GRIA1 HUMAN::P42261
Residue:906
BDBM50373889
NameBDBM50373889
Synonyms:CHEMBL402444
TypeSmall organic molecule
Emp. Form.C5H7N3O3S
Mol. Mass.189.192
SMILESN[C@H](Cc1ns[nH]c1=O)C(O)=O