Reaction Details
TargetEstrogen receptor beta
LigandBDBM50234790
Substrate/Competitorn/a
Meas. Tech.ChEMBL_468679 (CHEMBL951131)
Ki 12±n/a nM
Citation Minutolo, FBellini, RBertini, SCarboni, ILapucci, APistolesi, LProta, GRapposelli, SSolati, FTuccinardi, TMartinelli, AStossi, FCarlson, KEKatzenellenbogen, BSKatzenellenbogen, JAMacchia, M Monoaryl-substituted salicylaldoximes as ligands for estrogen receptor beta. J Med Chem51:1344-51 (2008) 
 
Estrogen receptor beta
Name:Estrogen receptor beta
Type:Protein
Mol. Mass.:59238.43
Organism:Homo sapiens (Human)
Description:Q92731
Residue:530
BDBM50234790
NameBDBM50234790
Synonyms:(E)-2-chloro-3,4'-dihydroxybiphenyl-4-carbaldehyde oxime CHEMBL405154
TypeSmall organic molecule
Emp. Form.C13H10ClNO3
Mol. Mass.263.676
SMILESOc1ccc(cc1)-c1ccc(CN=O)c(O)c1Cl